{"text_format":"1","workbook":"xlsx","n_sheets":3,"sheets":["Resultados","Jugadores","Hoja2"],"not_rendered":{"charts":0,"images":1,"macros":0,"external_links":0,"defined_names":0,"comments":0,"pivot_tables":0},"unopened":[],"bounds":{"document_bytes":16777216,"sheet_cells":100000,"rows_first":2000,"rows_last":500,"rows_between":2000,"halvings":0,"cell_chars":16384,"cell_head_chars":4096},"cells_cut":0,"cells_raw":0,"read":"whole","date_system":"1900"}

{"sheet":"Resultados","index":0,"n_rows":194,"n_cols":7,"rows_kept":194,"cut":false,"hidden":false,"merged":[[1,1,2,1],[4,2,4,3]]}
[]
[null,{"$error":"#VALUE!"},"CONFEDERACION PANAMERICANA DE BILLAR"]
[null,null,"Resultados Campeonatos Nacionales"]
[null,"Pais","Honduras",null,"Especialidad","Carambola"]
[null,"F. Afiliada",{"$f":"VLOOKUP(C4,Hoja2!B4:D24,3)","v":"Federación de Billar de Honduras"},null,"Categoria","Juvenil Masculina"]
[null,"Fecha",null,null,"Codigo Pais",{"$f":"VLOOKUP(C4,Hoja2!B4:C24,2,0)","v":"HON"}]
[null,"Codigo","Apellidos","Nombres","F. Nacimiento\ndd/mm/aaaa","Ubicación","P. Ranking"]
[null,null,null,null,null,null,{"$f":"IFERROR(_xlfn.IFS(F8=1,20,F8=2,15,F8=3,12,F8=4,12,F8=5,10,F8=6,10,F8=7,5,F8=8,5),\"\")","v":""}]
[null,null,null,null,null,null,{"$f":"IFERROR(_xlfn.IFS(F9=1,20,F9=2,15,F9=3,12,F9=4,12,F9=5,10,F9=6,10,F9=7,5,F9=8,5),\"\")","v":""}]
[null,null,null,null,null,null,{"$f":"IFERROR(_xlfn.IFS(F10=1,20,F10=2,15,F10=3,12,F10=4,12,F10=5,10,F10=6,10,F10=7,5,F10=8,5),\"\")","v":""}]
[null,null,null,null,null,null,{"$f":"IFERROR(_xlfn.IFS(F11=1,20,F11=2,15,F11=3,12,F11=4,12,F11=5,10,F11=6,10,F11=7,5,F11=8,5),\"\")","v":""}]
[null,null,null,null,null,null,{"$f":"IFERROR(_xlfn.IFS(F12=1,20,F12=2,15,F12=3,12,F12=4,12,F12=5,10,F12=6,10,F12=7,5,F12=8,5),\"\")","v":""}]
[null,null,null,null,null,null,{"$f":"IFERROR(_xlfn.IFS(F13=1,20,F13=2,15,F13=3,12,F13=4,12,F13=5,10,F13=6,10,F13=7,5,F13=8,5),\"\")","v":""}]
[null,null,null,null,null,null,{"$f":"IFERROR(_xlfn.IFS(F14=1,20,F14=2,15,F14=3,12,F14=4,12,F14=5,10,F14=6,10,F14=7,5,F14=8,5),\"\")","v":""}]
[null,null,null,null,null,null,{"$f":"IFERROR(_xlfn.IFS(F15=1,20,F15=2,15,F15=3,12,F15=4,12,F15=5,10,F15=6,10,F15=7,5,F15=8,5),\"\")","v":""}]
[null,null,null,null,null,null,{"$f":"IFERROR(_xlfn.IFS(F16=1,20,F16=2,15,F16=3,12,F16=4,12,F16=5,10,F16=6,10,F16=7,5,F16=8,5),\"\")","v":""}]
[null,null,null,null,null,null,{"$f":"IFERROR(_xlfn.IFS(F17=1,20,F17=2,15,F17=3,12,F17=4,12,F17=5,10,F17=6,10,F17=7,5,F17=8,5),\"\")","v":""}]
[null,null,null,null,null,null,{"$f":"IFERROR(_xlfn.IFS(F18=1,20,F18=2,15,F18=3,12,F18=4,12,F18=5,10,F18=6,10,F18=7,5,F18=8,5),\"\")","v":""}]
[null,null,null,null,null,null,{"$f":"IFERROR(_xlfn.IFS(F19=1,20,F19=2,15,F19=3,12,F19=4,12,F19=5,10,F19=6,10,F19=7,5,F19=8,5),\"\")","v":""}]
[null,null,null,null,null,null,{"$f":"IFERROR(_xlfn.IFS(F20=1,20,F20=2,15,F20=3,12,F20=4,12,F20=5,10,F20=6,10,F20=7,5,F20=8,5),\"\")","v":""}]
[null,null,null,null,null,null,{"$f":"IFERROR(_xlfn.IFS(F21=1,20,F21=2,15,F21=3,12,F21=4,12,F21=5,10,F21=6,10,F21=7,5,F21=8,5),\"\")","v":""}]
[null,null,null,null,null,null,{"$f":"IFERROR(_xlfn.IFS(F22=1,20,F22=2,15,F22=3,12,F22=4,12,F22=5,10,F22=6,10,F22=7,5,F22=8,5),\"\")","v":""}]
[null,null,null,null,null,null,{"$f":"IFERROR(_xlfn.IFS(F23=1,20,F23=2,15,F23=3,12,F23=4,12,F23=5,10,F23=6,10,F23=7,5,F23=8,5),\"\")","v":""}]
[null,null,null,null,null,null,{"$f":"IFERROR(_xlfn.IFS(F24=1,20,F24=2,15,F24=3,12,F24=4,12,F24=5,10,F24=6,10,F24=7,5,F24=8,5),\"\")","v":""}]
[null,null,null,null,null,null,{"$f":"IFERROR(_xlfn.IFS(F25=1,20,F25=2,15,F25=3,12,F25=4,12,F25=5,10,F25=6,10,F25=7,5,F25=8,5),\"\")","v":""}]
[null,null,null,null,null,null,{"$f":"IFERROR(_xlfn.IFS(F26=1,20,F26=2,15,F26=3,12,F26=4,12,F26=5,10,F26=6,10,F26=7,5,F26=8,5),\"\")","v":""}]
[null,null,null,null,null,null,{"$f":"IFERROR(_xlfn.IFS(F27=1,20,F27=2,15,F27=3,12,F27=4,12,F27=5,10,F27=6,10,F27=7,5,F27=8,5),\"\")","v":""}]
[null,null,null,null,null,null,{"$f":"IFERROR(_xlfn.IFS(F28=1,20,F28=2,15,F28=3,12,F28=4,12,F28=5,10,F28=6,10,F28=7,5,F28=8,5),\"\")","v":""}]
[null,null,null,null,null,null,{"$f":"IFERROR(_xlfn.IFS(F29=1,20,F29=2,15,F29=3,12,F29=4,12,F29=5,10,F29=6,10,F29=7,5,F29=8,5),\"\")","v":""}]
[null,null,null,null,null,null,{"$f":"IFERROR(_xlfn.IFS(F30=1,20,F30=2,15,F30=3,12,F30=4,12,F30=5,10,F30=6,10,F30=7,5,F30=8,5),\"\")","v":""}]
[null,null,null,null,null,null,{"$f":"IFERROR(_xlfn.IFS(F31=1,20,F31=2,15,F31=3,12,F31=4,12,F31=5,10,F31=6,10,F31=7,5,F31=8,5),\"\")","v":""}]
[null,null,null,null,null,null,{"$f":"IFERROR(_xlfn.IFS(F32=1,20,F32=2,15,F32=3,12,F32=4,12,F32=5,10,F32=6,10,F32=7,5,F32=8,5),\"\")","v":""}]
[null,null,null,null,null,null,{"$f":"IFERROR(_xlfn.IFS(F33=1,20,F33=2,15,F33=3,12,F33=4,12,F33=5,10,F33=6,10,F33=7,5,F33=8,5),\"\")","v":""}]
[null,null,null,null,null,null,{"$f":"IFERROR(_xlfn.IFS(F34=1,20,F34=2,15,F34=3,12,F34=4,12,F34=5,10,F34=6,10,F34=7,5,F34=8,5),\"\")","v":""}]
[null,null,null,null,null,null,{"$f":"IFERROR(_xlfn.IFS(F35=1,20,F35=2,15,F35=3,12,F35=4,12,F35=5,10,F35=6,10,F35=7,5,F35=8,5),\"\")","v":""}]
[null,null,null,null,null,null,{"$f":"IFERROR(_xlfn.IFS(F36=1,20,F36=2,15,F36=3,12,F36=4,12,F36=5,10,F36=6,10,F36=7,5,F36=8,5),\"\")","v":""}]
[null,null,null,null,null,null,{"$f":"IFERROR(_xlfn.IFS(F37=1,20,F37=2,15,F37=3,12,F37=4,12,F37=5,10,F37=6,10,F37=7,5,F37=8,5),\"\")","v":""}]
[null,null,null,null,null,null,{"$f":"IFERROR(_xlfn.IFS(F38=1,20,F38=2,15,F38=3,12,F38=4,12,F38=5,10,F38=6,10,F38=7,5,F38=8,5),\"\")","v":""}]
[null,null,null,null,null,null,{"$f":"IFERROR(_xlfn.IFS(F39=1,20,F39=2,15,F39=3,12,F39=4,12,F39=5,10,F39=6,10,F39=7,5,F39=8,5),\"\")","v":""}]
[null,null,null,null,null,null,{"$f":"IFERROR(_xlfn.IFS(F40=1,20,F40=2,15,F40=3,12,F40=4,12,F40=5,10,F40=6,10,F40=7,5,F40=8,5),\"\")","v":""}]
[null,null,null,null,null,null,{"$f":"IFERROR(_xlfn.IFS(F41=1,20,F41=2,15,F41=3,12,F41=4,12,F41=5,10,F41=6,10,F41=7,5,F41=8,5),\"\")","v":""}]
[null,null,null,null,null,null,{"$f":"IFERROR(_xlfn.IFS(F42=1,20,F42=2,15,F42=3,12,F42=4,12,F42=5,10,F42=6,10,F42=7,5,F42=8,5),\"\")","v":""}]
[null,null,null,null,null,null,{"$f":"IFERROR(_xlfn.IFS(F43=1,20,F43=2,15,F43=3,12,F43=4,12,F43=5,10,F43=6,10,F43=7,5,F43=8,5),\"\")","v":""}]
[null,null,null,null,null,null,{"$f":"IFERROR(_xlfn.IFS(F44=1,20,F44=2,15,F44=3,12,F44=4,12,F44=5,10,F44=6,10,F44=7,5,F44=8,5),\"\")","v":""}]
[null,null,null,null,null,null,{"$f":"IFERROR(_xlfn.IFS(F45=1,20,F45=2,15,F45=3,12,F45=4,12,F45=5,10,F45=6,10,F45=7,5,F45=8,5),\"\")","v":""}]
[null,null,null,null,null,null,{"$f":"IFERROR(_xlfn.IFS(F46=1,20,F46=2,15,F46=3,12,F46=4,12,F46=5,10,F46=6,10,F46=7,5,F46=8,5),\"\")","v":""}]
[null,null,null,null,null,null,{"$f":"IFERROR(_xlfn.IFS(F47=1,20,F47=2,15,F47=3,12,F47=4,12,F47=5,10,F47=6,10,F47=7,5,F47=8,5),\"\")","v":""}]
[null,null,null,null,null,null,{"$f":"IFERROR(_xlfn.IFS(F48=1,20,F48=2,15,F48=3,12,F48=4,12,F48=5,10,F48=6,10,F48=7,5,F48=8,5),\"\")","v":""}]
[null,null,null,null,null,null,{"$f":"IFERROR(_xlfn.IFS(F49=1,20,F49=2,15,F49=3,12,F49=4,12,F49=5,10,F49=6,10,F49=7,5,F49=8,5),\"\")","v":""}]
[null,null,null,null,null,null,{"$f":"IFERROR(_xlfn.IFS(F50=1,20,F50=2,15,F50=3,12,F50=4,12,F50=5,10,F50=6,10,F50=7,5,F50=8,5),\"\")","v":""}]
[null,null,null,null,null,null,{"$f":"IFERROR(_xlfn.IFS(F51=1,20,F51=2,15,F51=3,12,F51=4,12,F51=5,10,F51=6,10,F51=7,5,F51=8,5),\"\")","v":""}]
[null,null,null,null,null,null,{"$f":"IFERROR(_xlfn.IFS(F52=1,20,F52=2,15,F52=3,12,F52=4,12,F52=5,10,F52=6,10,F52=7,5,F52=8,5),\"\")","v":""}]
[null,null,null,null,null,null,{"$f":"IFERROR(_xlfn.IFS(F53=1,20,F53=2,15,F53=3,12,F53=4,12,F53=5,10,F53=6,10,F53=7,5,F53=8,5),\"\")","v":""}]
[null,null,null,null,null,null,{"$f":"IFERROR(_xlfn.IFS(F54=1,20,F54=2,15,F54=3,12,F54=4,12,F54=5,10,F54=6,10,F54=7,5,F54=8,5),\"\")","v":""}]
[null,null,null,null,null,null,{"$f":"IFERROR(_xlfn.IFS(F55=1,20,F55=2,15,F55=3,12,F55=4,12,F55=5,10,F55=6,10,F55=7,5,F55=8,5),\"\")","v":""}]
[null,null,null,null,null,null,{"$f":"IFERROR(_xlfn.IFS(F56=1,20,F56=2,15,F56=3,12,F56=4,12,F56=5,10,F56=6,10,F56=7,5,F56=8,5),\"\")","v":""}]
[null,null,null,null,null,null,{"$f":"IFERROR(_xlfn.IFS(F57=1,20,F57=2,15,F57=3,12,F57=4,12,F57=5,10,F57=6,10,F57=7,5,F57=8,5),\"\")","v":""}]
[null,null,null,null,null,null,{"$f":"IFERROR(_xlfn.IFS(F58=1,20,F58=2,15,F58=3,12,F58=4,12,F58=5,10,F58=6,10,F58=7,5,F58=8,5),\"\")","v":""}]
[null,null,null,null,null,null,{"$f":"IFERROR(_xlfn.IFS(F59=1,20,F59=2,15,F59=3,12,F59=4,12,F59=5,10,F59=6,10,F59=7,5,F59=8,5),\"\")","v":""}]
[null,null,null,null,null,null,{"$f":"IFERROR(_xlfn.IFS(F60=1,20,F60=2,15,F60=3,12,F60=4,12,F60=5,10,F60=6,10,F60=7,5,F60=8,5),\"\")","v":""}]
[null,null,null,null,null,null,{"$f":"IFERROR(_xlfn.IFS(F61=1,20,F61=2,15,F61=3,12,F61=4,12,F61=5,10,F61=6,10,F61=7,5,F61=8,5),\"\")","v":""}]
[null,null,null,null,null,null,{"$f":"IFERROR(_xlfn.IFS(F62=1,20,F62=2,15,F62=3,12,F62=4,12,F62=5,10,F62=6,10,F62=7,5,F62=8,5),\"\")","v":""}]
[null,null,null,null,null,null,{"$f":"IFERROR(_xlfn.IFS(F63=1,20,F63=2,15,F63=3,12,F63=4,12,F63=5,10,F63=6,10,F63=7,5,F63=8,5),\"\")","v":""}]
[null,null,null,null,null,null,{"$f":"IFERROR(_xlfn.IFS(F64=1,20,F64=2,15,F64=3,12,F64=4,12,F64=5,10,F64=6,10,F64=7,5,F64=8,5),\"\")","v":""}]
[null,null,null,null,null,null,{"$f":"IFERROR(_xlfn.IFS(F65=1,20,F65=2,15,F65=3,12,F65=4,12,F65=5,10,F65=6,10,F65=7,5,F65=8,5),\"\")","v":""}]
[null,null,null,null,null,null,{"$f":"IFERROR(_xlfn.IFS(F66=1,20,F66=2,15,F66=3,12,F66=4,12,F66=5,10,F66=6,10,F66=7,5,F66=8,5),\"\")","v":""}]
[null,null,null,null,null,null,{"$f":"IFERROR(_xlfn.IFS(F67=1,20,F67=2,15,F67=3,12,F67=4,12,F67=5,10,F67=6,10,F67=7,5,F67=8,5),\"\")","v":""}]
[null,null,null,null,null,null,{"$f":"IFERROR(_xlfn.IFS(F68=1,20,F68=2,15,F68=3,12,F68=4,12,F68=5,10,F68=6,10,F68=7,5,F68=8,5),\"\")","v":""}]
[null,null,null,null,null,null,{"$f":"IFERROR(_xlfn.IFS(F69=1,20,F69=2,15,F69=3,12,F69=4,12,F69=5,10,F69=6,10,F69=7,5,F69=8,5),\"\")","v":""}]
[null,null,null,null,null,null,{"$f":"IFERROR(_xlfn.IFS(F70=1,20,F70=2,15,F70=3,12,F70=4,12,F70=5,10,F70=6,10,F70=7,5,F70=8,5),\"\")","v":""}]
[null,null,null,null,null,null,{"$f":"IFERROR(_xlfn.IFS(F71=1,20,F71=2,15,F71=3,12,F71=4,12,F71=5,10,F71=6,10,F71=7,5,F71=8,5),\"\")","v":""}]
[null,null,null,null,null,null,{"$f":"IFERROR(_xlfn.IFS(F72=1,20,F72=2,15,F72=3,12,F72=4,12,F72=5,10,F72=6,10,F72=7,5,F72=8,5),\"\")","v":""}]
[null,null,null,null,null,null,{"$f":"IFERROR(_xlfn.IFS(F73=1,20,F73=2,15,F73=3,12,F73=4,12,F73=5,10,F73=6,10,F73=7,5,F73=8,5),\"\")","v":""}]
[null,null,null,null,null,null,{"$f":"IFERROR(_xlfn.IFS(F74=1,20,F74=2,15,F74=3,12,F74=4,12,F74=5,10,F74=6,10,F74=7,5,F74=8,5),\"\")","v":""}]
[null,null,null,null,null,null,{"$f":"IFERROR(_xlfn.IFS(F75=1,20,F75=2,15,F75=3,12,F75=4,12,F75=5,10,F75=6,10,F75=7,5,F75=8,5),\"\")","v":""}]
[null,null,null,null,null,null,{"$f":"IFERROR(_xlfn.IFS(F76=1,20,F76=2,15,F76=3,12,F76=4,12,F76=5,10,F76=6,10,F76=7,5,F76=8,5),\"\")","v":""}]
[null,null,null,null,null,null,{"$f":"IFERROR(_xlfn.IFS(F77=1,20,F77=2,15,F77=3,12,F77=4,12,F77=5,10,F77=6,10,F77=7,5,F77=8,5),\"\")","v":""}]
[null,null,null,null,null,null,{"$f":"IFERROR(_xlfn.IFS(F78=1,20,F78=2,15,F78=3,12,F78=4,12,F78=5,10,F78=6,10,F78=7,5,F78=8,5),\"\")","v":""}]
[null,null,null,null,null,null,{"$f":"IFERROR(_xlfn.IFS(F79=1,20,F79=2,15,F79=3,12,F79=4,12,F79=5,10,F79=6,10,F79=7,5,F79=8,5),\"\")","v":""}]
[null,null,null,null,null,null,{"$f":"IFERROR(_xlfn.IFS(F80=1,20,F80=2,15,F80=3,12,F80=4,12,F80=5,10,F80=6,10,F80=7,5,F80=8,5),\"\")","v":""}]
[null,null,null,null,null,null,{"$f":"IFERROR(_xlfn.IFS(F81=1,20,F81=2,15,F81=3,12,F81=4,12,F81=5,10,F81=6,10,F81=7,5,F81=8,5),\"\")","v":""}]
[null,null,null,null,null,null,{"$f":"IFERROR(_xlfn.IFS(F82=1,20,F82=2,15,F82=3,12,F82=4,12,F82=5,10,F82=6,10,F82=7,5,F82=8,5),\"\")","v":""}]
[null,null,null,null,null,null,{"$f":"IFERROR(_xlfn.IFS(F83=1,20,F83=2,15,F83=3,12,F83=4,12,F83=5,10,F83=6,10,F83=7,5,F83=8,5),\"\")","v":""}]
[null,null,null,null,null,null,{"$f":"IFERROR(_xlfn.IFS(F84=1,20,F84=2,15,F84=3,12,F84=4,12,F84=5,10,F84=6,10,F84=7,5,F84=8,5),\"\")","v":""}]
[null,null,null,null,null,null,{"$f":"IFERROR(_xlfn.IFS(F85=1,20,F85=2,15,F85=3,12,F85=4,12,F85=5,10,F85=6,10,F85=7,5,F85=8,5),\"\")","v":""}]
[null,null,null,null,null,null,{"$f":"IFERROR(_xlfn.IFS(F86=1,20,F86=2,15,F86=3,12,F86=4,12,F86=5,10,F86=6,10,F86=7,5,F86=8,5),\"\")","v":""}]
[null,null,null,null,null,null,{"$f":"IFERROR(_xlfn.IFS(F87=1,20,F87=2,15,F87=3,12,F87=4,12,F87=5,10,F87=6,10,F87=7,5,F87=8,5),\"\")","v":""}]
[null,null,null,null,null,null,{"$f":"IFERROR(_xlfn.IFS(F88=1,20,F88=2,15,F88=3,12,F88=4,12,F88=5,10,F88=6,10,F88=7,5,F88=8,5),\"\")","v":""}]
[null,null,null,null,null,null,{"$f":"IFERROR(_xlfn.IFS(F89=1,20,F89=2,15,F89=3,12,F89=4,12,F89=5,10,F89=6,10,F89=7,5,F89=8,5),\"\")","v":""}]
[null,null,null,null,null,null,{"$f":"IFERROR(_xlfn.IFS(F90=1,20,F90=2,15,F90=3,12,F90=4,12,F90=5,10,F90=6,10,F90=7,5,F90=8,5),\"\")","v":""}]
[]
[]
[null,null,null,null,null,null,{"$f":"IFERROR(_xlfn.IFS(F91=1,20,F91=2,15,F91=3,12,F91=4,12,F91=5,10,F91=6,10,F91=7,5,F91=8,5),\"\")","v":""}]
[null,null,null,null,null,null,{"$f":"IFERROR(_xlfn.IFS(F92=1,20,F92=2,15,F92=3,12,F92=4,12,F92=5,10,F92=6,10,F92=7,5,F92=8,5),\"\")","v":""}]
[null,null,null,null,null,null,{"$f":"IFERROR(_xlfn.IFS(F93=1,20,F93=2,15,F93=3,12,F93=4,12,F93=5,10,F93=6,10,F93=7,5,F93=8,5),\"\")","v":""}]
[null,null,null,null,null,null,{"$f":"IFERROR(_xlfn.IFS(F94=1,20,F94=2,15,F94=3,12,F94=4,12,F94=5,10,F94=6,10,F94=7,5,F94=8,5),\"\")","v":""}]
[null,null,null,null,null,null,{"$f":"IFERROR(_xlfn.IFS(F95=1,20,F95=2,15,F95=3,12,F95=4,12,F95=5,10,F95=6,10,F95=7,5,F95=8,5),\"\")","v":""}]
[null,null,null,null,null,null,{"$f":"IFERROR(_xlfn.IFS(F96=1,20,F96=2,15,F96=3,12,F96=4,12,F96=5,10,F96=6,10,F96=7,5,F96=8,5),\"\")","v":""}]
[null,null,null,null,null,null,{"$f":"IFERROR(_xlfn.IFS(F97=1,20,F97=2,15,F97=3,12,F97=4,12,F97=5,10,F97=6,10,F97=7,5,F97=8,5),\"\")","v":""}]
[null,null,null,null,null,null,{"$f":"IFERROR(_xlfn.IFS(F98=1,20,F98=2,15,F98=3,12,F98=4,12,F98=5,10,F98=6,10,F98=7,5,F98=8,5),\"\")","v":""}]
[null,null,null,null,null,null,{"$f":"IFERROR(_xlfn.IFS(F99=1,20,F99=2,15,F99=3,12,F99=4,12,F99=5,10,F99=6,10,F99=7,5,F99=8,5),\"\")","v":""}]
[null,null,null,null,null,null,{"$f":"IFERROR(_xlfn.IFS(F100=1,20,F100=2,15,F100=3,12,F100=4,12,F100=5,10,F100=6,10,F100=7,5,F100=8,5),\"\")","v":""}]
[null,null,null,null,null,null,{"$f":"IFERROR(_xlfn.IFS(F101=1,20,F101=2,15,F101=3,12,F101=4,12,F101=5,10,F101=6,10,F101=7,5,F101=8,5),\"\")","v":""}]
[null,null,null,null,null,null,{"$f":"IFERROR(_xlfn.IFS(F102=1,20,F102=2,15,F102=3,12,F102=4,12,F102=5,10,F102=6,10,F102=7,5,F102=8,5),\"\")","v":""}]
[null,null,null,null,null,null,{"$f":"IFERROR(_xlfn.IFS(F103=1,20,F103=2,15,F103=3,12,F103=4,12,F103=5,10,F103=6,10,F103=7,5,F103=8,5),\"\")","v":""}]
[null,null,null,null,null,null,{"$f":"IFERROR(_xlfn.IFS(F104=1,20,F104=2,15,F104=3,12,F104=4,12,F104=5,10,F104=6,10,F104=7,5,F104=8,5),\"\")","v":""}]
[null,null,null,null,null,null,{"$f":"IFERROR(_xlfn.IFS(F105=1,20,F105=2,15,F105=3,12,F105=4,12,F105=5,10,F105=6,10,F105=7,5,F105=8,5),\"\")","v":""}]
[null,null,null,null,null,null,{"$f":"IFERROR(_xlfn.IFS(F106=1,20,F106=2,15,F106=3,12,F106=4,12,F106=5,10,F106=6,10,F106=7,5,F106=8,5),\"\")","v":""}]
[null,null,null,null,null,null,{"$f":"IFERROR(_xlfn.IFS(F107=1,20,F107=2,15,F107=3,12,F107=4,12,F107=5,10,F107=6,10,F107=7,5,F107=8,5),\"\")","v":""}]
[null,null,null,null,null,null,{"$f":"IFERROR(_xlfn.IFS(F108=1,20,F108=2,15,F108=3,12,F108=4,12,F108=5,10,F108=6,10,F108=7,5,F108=8,5),\"\")","v":""}]
[null,null,null,null,null,null,{"$f":"IFERROR(_xlfn.IFS(F109=1,20,F109=2,15,F109=3,12,F109=4,12,F109=5,10,F109=6,10,F109=7,5,F109=8,5),\"\")","v":""}]
[null,null,null,null,null,null,{"$f":"IFERROR(_xlfn.IFS(F110=1,20,F110=2,15,F110=3,12,F110=4,12,F110=5,10,F110=6,10,F110=7,5,F110=8,5),\"\")","v":""}]
[null,null,null,null,null,null,{"$f":"IFERROR(_xlfn.IFS(F111=1,20,F111=2,15,F111=3,12,F111=4,12,F111=5,10,F111=6,10,F111=7,5,F111=8,5),\"\")","v":""}]
[null,null,null,null,null,null,{"$f":"IFERROR(_xlfn.IFS(F112=1,20,F112=2,15,F112=3,12,F112=4,12,F112=5,10,F112=6,10,F112=7,5,F112=8,5),\"\")","v":""}]
[null,null,null,null,null,null,{"$f":"IFERROR(_xlfn.IFS(F113=1,20,F113=2,15,F113=3,12,F113=4,12,F113=5,10,F113=6,10,F113=7,5,F113=8,5),\"\")","v":""}]
[null,null,null,null,null,null,{"$f":"IFERROR(_xlfn.IFS(F114=1,20,F114=2,15,F114=3,12,F114=4,12,F114=5,10,F114=6,10,F114=7,5,F114=8,5),\"\")","v":""}]
[null,null,null,null,null,null,{"$f":"IFERROR(_xlfn.IFS(F115=1,20,F115=2,15,F115=3,12,F115=4,12,F115=5,10,F115=6,10,F115=7,5,F115=8,5),\"\")","v":""}]
[null,null,null,null,null,null,{"$f":"IFERROR(_xlfn.IFS(F116=1,20,F116=2,15,F116=3,12,F116=4,12,F116=5,10,F116=6,10,F116=7,5,F116=8,5),\"\")","v":""}]
[null,null,null,null,null,null,{"$f":"IFERROR(_xlfn.IFS(F117=1,20,F117=2,15,F117=3,12,F117=4,12,F117=5,10,F117=6,10,F117=7,5,F117=8,5),\"\")","v":""}]
[null,null,null,null,null,null,{"$f":"IFERROR(_xlfn.IFS(F118=1,20,F118=2,15,F118=3,12,F118=4,12,F118=5,10,F118=6,10,F118=7,5,F118=8,5),\"\")","v":""}]
{"$rows_left_out":75}
{"sheet":"Jugadores","index":1,"n_rows":1,"n_cols":9,"rows_kept":1,"cut":false,"hidden":false,"merged":[]}
["Nº","APELLIDOS","NOMBRES","PAÍS","CAT","SEX","ID-CPB","EMAIL","F. Nacimiento\ndd/mm/aaaa"]

{"sheet":"Hoja2","index":2,"n_rows":24,"n_cols":7,"rows_kept":24,"cut":false,"hidden":true,"merged":[]}
[]
[]
[null,"Pais","Abreviatura","F. Afiliada","Especialidad","Categoria","Sexo"]
[null,"Argentina",{"$f":"UPPER(LEFT(B4,3))","v":"ARG"},{"$f":"_xlfn.CONCAT(\"Federación de Billar de \",B4)","v":"Federación de Billar de Argentina"},"Carambola","Max. Masculina"]
[null,"Aruba",{"$f":"UPPER(LEFT(B5,3))","v":"ARU"},{"$f":"_xlfn.CONCAT(\"Federación de Billar de \",B5)","v":"Federación de Billar de Aruba"},"5 Quillas","Max. Femenina"]
[null,"Belice","BEL","Federación de Billar de Belice","Bola 8","Juvenil Masculina"]
[null,"Bolivia","BOL","Federación de Billar de Bolivia","Bola 9","Juvenil Femenina"]
[null,"Bonaire","BON","Federación de Billar de Bonaire","Bola 10","Equipos"]
[null,"Brasil","BRA","Federación de Billar de Brasil","Heyball"]
[null,"Chile","CHI","Federación de Billar de Chile","Snoker"]
[null,"Colombia","COL","Federación de Billar de Colombia"]
[null,"Costa Rica","COS","Federación de Billar de Costa Rica"]
[null,"Curazao","CUR","Federación de Billar de Curazao"]
[null,"Ecuador","ECU","Federación de Billar de Ecuador"]
[null,"Estados Unidos","EST","Federación de Billar de Estados Unidos"]
[null,"Guatemala","GUA","Federación de Billar de Guatemala"]
[null,"Honduras","HON","Federación de Billar de Honduras"]
[null,"Mexico","MEX","Federación de Billar de Mexico"]
[null,"Nicaragua","NIC","Federación de Billar de Nicaragua"]
[null,"Panama","PAN","Federación de Billar de Panama"]
[null,"Peru","PER","Federación de Billar de Peru"]
[null,"Rep. Dominicana","REP","Federación de Billar de Rep. Dominicana"]
[null,"Uruguay","URU","Federación de Billar de Uruguay"]
[null,"Venezuela","VEN","Federación de Billar de Venezuela"]